{"text_format":"1","workbook":"xlsx","n_sheets":7,"sheets":["Cover","Numericable","Telenet","Voo","Offers","Overview","Lists"],"not_rendered":{"charts":0,"images":0,"macros":1,"external_links":0,"defined_names":19,"comments":3,"pivot_tables":0},"unopened":[],"bounds":{"document_bytes":16777216,"sheet_cells":100000,"rows_first":2000,"rows_last":500,"rows_between":2000,"halvings":0,"cell_chars":16384,"cell_head_chars":4096},"cells_cut":0,"cells_raw":0,"read":"whole","date_system":"1900"}

{"sheet":"Cover","index":0,"n_rows":44,"n_cols":3,"rows_kept":44,"cut":false,"hidden":false,"merged":[]}
[]
[null,null,"CRC : Retails Minus tariffs for cable wholesale access"]
[]
[null,null,"Annex to the CRC communication of 11/12/2013 concerning setting wholesale access prices to cable networks. "]
[]
[null,null,"This file is an annexe to the CRC communication of 11/12/2013. The purpose of this file is to present in details the calculations for setting wholesale access prices to cable networks based on retail offers from cable operators and minus values from the CRC decisions. "]
[]
[null,null,"Usage : (1) select some operator's sheet, (2) fill in or update green tables if needed, (3) select retail offer in cell C52. The wholesale tariff is then computed in the orange table, the result is given in cell D98."]
[null,null,"The \"Overview\" sheets makes an overview of all different offers for each operator. The button on the bottom of the sheet runs a macro that computes the tariffs for each offer and updates the overview table."]
[]
[null,"Version : ","1.0"]
[null,"Date : ","2013-12-11"]
[]
[]
[null,"Minus Values :"]
[null,null,"Numericable"]
[null,"Analog TV :",0.2]
[null,"Digital TV :",0.2]
[null,"Pack :",0.2]
[null,null,"Telenet"]
{"$rows_left_out":25}
{"sheet":"Numericable","index":1,"n_rows":98,"n_cols":25,"rows_kept":98,"cut":false,"hidden":false,"merged":[[2,12,2,13],[2,14,2,17],[2,18,2,20],[2,21,2,22]]}
["Numericable"]
[]
["Retail offers :",null,null,null,null,null,null,null,null,null,"Offer characteristics :",null,"Analog TV",null,"Digital TV",null,null,null,"Broadband",null,null,"Telephony",null,"Extras"]
[null,"Id.","Name","Type","Retail price (VAT incl.)","Retail price (VAT excl.)","Remark","Link","Legend :","Label / Name",null,"Name","Analog TV","#Channels","Digital TV","#Channels","#HD Channels","Decoder","Broadband","Bitrate Dn[/Up]","Quota","Telephony","Options","-"]
[null,{"$f":"IF(C5<>\"-\",1,\"\")","v":1},"Télédistribution","Analog TV",17.809999999999999,{"$f":"IF(E5<>\"\",E5/1.21,\"\")","v":14.71900826446281},null,"Link",null,"Computation",null,{"$f":"C5","v":"Télédistribution"},"X",25,"-","-","-","-","-","-","-","-","-","-"]
[null,{"$f":"IF(C6<>\"-\",B5+1,\"\")","v":2},"TV Plus (digital)","Digital TV",{"$f":"21.9+6","v":27.9},{"$f":"IF(E6<>\"\",E6/1.21,\"\")","v":23.057851239669422},"Incl. HD Decoder (6€)","Link",null,"Required Input",null,{"$f":"C6","v":"TV Plus (digital)"},"X",25,"X",130,17,"HD/HDD","-","-","-","-","-","-"]
[null,3,"Duo TV+Web","Dual play",39.9,32.97520661157025,"TV Start + décodeur HD PVR + BB50M 100G","Link",null,"Optional Input",null,"Duo TV+Web","X",25,"X",100,12,"HD/HDD","X","50M/2.5M","100G","-","-","-"]
[null,4,"Triple Play Extra","Triple play",55.9,46.198347107438018,"TV Plus + Tél. extra & voisins + BB 100M illimité + Box 160","Link",null,"Selection",null,"Triple Play Extra","X",25,"X",130,17,"Box 160 + HD","X","100M/5M","Illimité","X","Extra + Voisins","-"]
[null,5,"Triple Play Max","Triple play",69.900000000000006,57.768595041322321,"TV Plus & Bouquet Premium + Tél. extra & monde + BB 200M illimité + Box 320","Link",null,"Output",null,"Triple Play Max","X",25,"X",130,17,"Box 320 + HD","X","200M/8M","Illimité","X","Extra + Monde","Mini Premium"]
[null,"","-",null,null,"",null,null,null,null,null,"-"]
[null,"","-",null,null,"",null,null,null,null,null,"-"]
[null,"","-",null,null,null,null,null,null,null,null,"-"]
[null,"","-",null,null,"",null,null,null,null,null,"-"]
[null,"","-",null,null,"",null,null,null,null,null,"-"]
[null,"","-",null,null,"",null,null,null,null,null,"-"]
[null,"","-",null,null,null,null,null,null,null,null,"-"]
[null,null,"This table includes retail offers that are used as starting point for setting wholesale prices."]
["Standalone components :",null,null,null,null,null,null,null,null,null,null,"Packs composition :","This table maps \"packed\" retail offers to standalone components. "]
[null,"Id. ","Name","Type","Retail price (VAT incl.)","Retail price (VAT excl.)","Remark","Discount","Excluded","Link",null,null,{"$f":"TRANSPOSE(C5:C16)","v":"Télédistribution"},"TV Plus (digital)","Duo TV+Web","Triple Play Extra","Triple Play Max","-","-","-","-","-","-","-"]
[null,{"$f":"IF(C20<>\"-\",1,\"\")","v":1},"Cable access (rights incl.)","Analog TV",17.809999999999999,{"$f":"IF(E20<>\"\",E20/1.21,\"\")","v":14.71900826446281},null,1,0,"Link",null,{"$f":"C20","v":"Cable access (rights incl.)"},0,0,0,0,0]
{"$rows_left_out":79}
{"sheet":"Telenet","index":2,"n_rows":98,"n_cols":25,"rows_kept":98,"cut":false,"hidden":false,"merged":[[2,12,2,13],[2,14,2,17],[2,18,2,20],[2,21,2,22]]}
["Telenet"]
[]
["Retail offers :",null,null,null,null,null,null,null,null,null,"Offer characteristics :",null,"Analog TV",null,"Digital TV",null,null,null,"Broadband",null,null,"Telephony",null,"Extras"]
[null,"Id.","Name","Type","Retail price (VAT incl.)","Retail price (VAT excl.)","Remark","Link","Legend :","Label / Name",null,"Name","Analog TV","#Channels","Digital TV","#Channels","#HD Channels","Decoder","Broadband","Bitrate Dn[/Up]","Quota","Telephony","Options","-"]
[null,{"$f":"IF(C5<>\"-\",1,\"\")","v":1},"TV Analogique","Analog TV",15.2,{"$f":"IF(E5<>\"\",E5/1.21,\"\")","v":12.561983471074379},null,"Link",null,"Computation",null,{"$f":"C5","v":"TV Analogique"},"X","?","-","-","-","-","-","-","-","-","-","-"]
[null,{"$f":"IF(C6<>\"-\",B5+1,\"\")","v":2},"TV Digitale","Digital TV",23.4,{"$f":"IF(E6<>\"\",E6/1.21,\"\")","v":19.33884297520661},"Price incl. decoder (8,20€)","Link",null,"Required Input",null,{"$f":"C6","v":"TV Digitale"},"X","?","X",75,"?","HD Digicorder","-","-","-","-","-","-"]
[null,{"$f":"IF(C7<>\"-\",B6+1,\"\")","v":3},"Whop","Triple play",{"$f":"53.25+8.2","v":61.45},50.785123966942152,"Price incl. decoder (8,20€)","Link",null,"Optional Input",null,"Whop","X","?","X",75,"?","HD Digicorder","X","60M/4M","100G","X","FreePhone EU","-"]
[null,{"$f":"IF(C8<>\"-\",B7+1,\"\")","v":4},"Whoppa","Triple play",{"$f":"63.5+8.2","v":71.7},59.256198347107443,"Price incl. decoder (8,20€)","Link",null,"Selection",null,"Whoppa","X","?","X",75,"?","HD Digicorder","X","120M/6M","Illimité","X","FreePhone EU","-"]
[null,{"$f":"IF(C9<>\"-\",B8+1,\"\")","v":""},"-",null,null,"",null,null,null,"Output",null,"-"]
[null,{"$f":"IF(C10<>\"-\",B9+1,\"\")","v":""},"-",null,null,"",null,null,null,null,null,"-"]
[null,{"$f":"IF(C11<>\"-\",B10+1,\"\")","v":""},"-",null,null,"",null,null,null,null,null,"-"]
[null,"","-",null,null,"",null,null,null,null,null,"-"]
[null,"","-",null,null,"",null,null,null,null,null,"-"]
[null,"","-",null,null,"",null,null,null,null,null,"-"]
[null,"","-",null,null,null,null,null,null,null,null,"-"]
[null,"","-",null,null,null,null,null,null,null,null,"-"]
[null,null,"This table includes retail offers that are used as starting point for setting wholesale prices."]
["Standalone components :",null,null,null,null,null,null,null,null,null,null,"Packs composition :","This table maps \"packed\" retail offers to standalone components. "]
[null,"Id. ","Name","Type","Retail price (VAT incl.)","Retail price (VAT excl.)","Remark","Discount","Excluded","Link",null,null,{"$f":"TRANSPOSE(C5:C16)","v":"TV Analogique"},"TV Digitale","Whop","Whoppa","-","-","-","-","-","-","-","-"]
[null,{"$f":"IF(C20<>\"-\",1,\"\")","v":1},"Cable access (rights incl.)","Analog TV",15.2,{"$f":"IF(E20<>\"\",E20/1.21,\"\")","v":12.561983471074379},null,1,0,"Link",null,{"$f":"C20","v":"Cable access (rights incl.)"},0,0,0,0]
{"$rows_left_out":79}
{"sheet":"Voo","index":3,"n_rows":98,"n_cols":25,"rows_kept":98,"cut":false,"hidden":false,"merged":[[2,12,2,13],[2,18,2,20],[2,21,2,22],[2,14,2,17]]}
["Voo"]
[]
["Retail offers :",null,null,null,null,null,null,null,null,null,"Offer characteristics :",null,"Analog TV",null,"Digital TV",null,null,null,"Broadband",null,null,"Telephony",null,"Extras"]
[null,"Id.","Name","Type","Retail price (VAT incl.)","Retail price (VAT excl.)","Remark","Link","Legend :","Label / Name",null,"Name","Analog TV","#Channels","Digital TV","#Channels","#HD Channels","Decoder","Broadband","Bitrate Dn[/Up]","Quota","Telephony","Options","-"]
[null,{"$f":"IF(C5<>\"-\",1,\"\")","v":1},"TV Analogique","Analog TV",16.86,{"$f":"IF(E5<>\"\",E5/1.21,\"\")","v":13.933884297520661},null,"Link",null,"Computation",null,{"$f":"C5","v":"TV Analogique"},"X","20+","-","-","-","-","-","-","-","-","-","-"]
[null,{"$f":"IF(C6<>\"-\",B5+1,\"\")","v":2},"TV Numérique Interactive","Digital TV",{"$f":"16.86+6.09","v":22.95},{"$f":"IF(E6<>\"\",E6/1.21,\"\")","v":18.966942148760332},"Price incl. decoder (6,09€)","Link",null,"Required Input",null,{"$f":"C6","v":"TV Numérique Interactive"},"X","20+","X","65+",11,"VOOcorder","-","-","-","-","-","-"]
[null,{"$f":"IF(C7<>\"-\",B6+1,\"\")","v":3},"Duo TV NET \"Un peu\"","Dual play",40.950000000000003,33.842975206611577,"Price \"all in\"","Link",null,"Optional Input",null,"Duo TV NET \"Un peu\"","X","20+","X","65+",11,"VOOcorder","X","30M","100G","-","-","-"]
[null,{"$f":"IF(C8<>\"-\",B7+1,\"\")","v":4},"Duo TV NET \"Beaucoup\"","Dual play",50.95,42.107438016528931,"Price \"all in\"","Link",null,"Selection",null,"Duo TV NET \"Beaucoup\"","X","20+","X","65+",11,"VOOcorder","X","40M","Illimité","-","-","-"]
[null,{"$f":"IF(C9<>\"-\",B8+1,\"\")","v":5},"Duo TV NET \"Passionnement\"","Dual play",60.95,50.371900826446286,"Price \"all in\"","Link",null,"Output",null,"Duo TV NET \"Passionnement\"","X","20+","X","65+",11,"VOOcorder","X","50M","Illimité","-","-","VooFoot"]
[null,{"$f":"IF(C10<>\"-\",B9+1,\"\")","v":6},"Duo TV NET \"A la folie\"","Dual play",70.95,58.63636363636364,"Price \"all in\"","Link",null,null,null,"Duo TV NET \"A la folie\"","X","20+","X","65+",11,"VOOcorder","X","70M","Illimité","-","-","VooFoot"]
[null,{"$f":"IF(C11<>\"-\",B10+1,\"\")","v":7},"Duo TV NET \"Fiber 100\"","Dual play",90.95,75.165289256198349,"Price \"all in\"","Link",null,null,null,"Duo TV NET \"Fiber 100\"","X","20+","X","65+",11,"VOOcorder","X","100M","Illimité","-","-","VooFoot"]
[null,"","-",null,null,"",null,null,null,null,null,"-"]
[null,"","-",null,null,"",null,null,null,null,null,"-"]
[null,"","-",null,null,"",null,null,null,null,null,"-"]
[null,"","-",null,null,"",null,null,null,null,null,"-"]
[null,"","-",null,null,"",null,null,null,null,null,"-"]
[null,null,"This table includes retail offers that are used as starting point for setting wholesale prices."]
["Standalone components :",null,null,null,null,null,null,null,null,null,null,"Packs composition :","This table maps \"packed\" retail offers to standalone components. "]
[null,"Id. ","Name","Type","Retail price (VAT incl.)","Retail price (VAT excl.)","Remark","Discount","Excluded","Link",null,null,{"$f":"TRANSPOSE(C5:C16)","v":"TV Analogique"},"TV Numérique Interactive","Duo TV NET \"Un peu\"","Duo TV NET \"Beaucoup\"","Duo TV NET \"Passionnement\"","Duo TV NET \"A la folie\"","Duo TV NET \"Fiber 100\"","-","-","-","-","-"]
[null,{"$f":"IF(C20<>\"-\",1,\"\")","v":1},"Cable access (rights incl.)","Analog TV",16.86,{"$f":"IF(E20<>\"\",E20/1.21,\"\")","v":13.933884297520661},null,1,0,"Link",null,{"$f":"C20","v":"Cable access (rights incl.)"},0,0,0,0,0,0,0]
{"$rows_left_out":79}
{"sheet":"Offers","index":4,"n_rows":44,"n_cols":13,"rows_kept":44,"cut":false,"hidden":false,"merged":[[30,1,30,2],[30,3,30,6],[30,7,30,9],[30,10,30,11],[0,1,0,2],[0,3,0,6],[0,7,0,9],[0,10,0,11],[15,1,15,2],[15,3,15,6],[15,7,15,9],[15,10,15,11]]}
["Numericable","Analog TV",null,"Digital TV",null,null,null,"Broadband",null,null,"Telephony",null,"Extras"]
["Name","Analog TV","#Channels","Digital TV","#Channels","#HD Channels","Decoder","Broadband","Bitrate Dn[/Up]","Quota","Telephony","Options","-"]
[{"$f":"Numericable!L5","v":"Télédistribution"},{"$f":"IF($A3=\"-\",\"\",Numericable!M5)","v":"X"},{"$f":"IF($A3=\"-\",\"\",Numericable!N5)","v":25},{"$f":"IF($A3=\"-\",\"\",Numericable!O5)","v":"-"},{"$f":"IF($A3=\"-\",\"\",Numericable!P5)","v":"-"},{"$f":"IF($A3=\"-\",\"\",Numericable!Q5)","v":"-"},{"$f":"IF($A3=\"-\",\"\",Numericable!R5)","v":"-"},{"$f":"IF($A3=\"-\",\"\",Numericable!S5)","v":"-"},{"$f":"IF($A3=\"-\",\"\",Numericable!T5)","v":"-"},{"$f":"IF($A3=\"-\",\"\",Numericable!U5)","v":"-"},{"$f":"IF($A3=\"-\",\"\",Numericable!V5)","v":"-"},{"$f":"IF($A3=\"-\",\"\",Numericable!W5)","v":"-"},{"$f":"IF($A3=\"-\",\"\",Numericable!X5)","v":"-"}]
[{"$f":"Numericable!L6","v":"TV Plus (digital)"},{"$f":"IF($A4=\"-\",\"\",Numericable!M6)","v":"X"},{"$f":"IF($A4=\"-\",\"\",Numericable!N6)","v":25},{"$f":"IF($A4=\"-\",\"\",Numericable!O6)","v":"X"},{"$f":"IF($A4=\"-\",\"\",Numericable!P6)","v":130},{"$f":"IF($A4=\"-\",\"\",Numericable!Q6)","v":17},{"$f":"IF($A4=\"-\",\"\",Numericable!R6)","v":"HD/HDD"},{"$f":"IF($A4=\"-\",\"\",Numericable!S6)","v":"-"},{"$f":"IF($A4=\"-\",\"\",Numericable!T6)","v":"-"},{"$f":"IF($A4=\"-\",\"\",Numericable!U6)","v":"-"},{"$f":"IF($A4=\"-\",\"\",Numericable!V6)","v":"-"},{"$f":"IF($A4=\"-\",\"\",Numericable!W6)","v":"-"},{"$f":"IF($A4=\"-\",\"\",Numericable!X6)","v":"-"}]
[{"$f":"Numericable!L7","v":"Duo TV+Web"},{"$f":"IF($A5=\"-\",\"\",Numericable!M7)","v":"X"},{"$f":"IF($A5=\"-\",\"\",Numericable!N7)","v":25},{"$f":"IF($A5=\"-\",\"\",Numericable!O7)","v":"X"},{"$f":"IF($A5=\"-\",\"\",Numericable!P7)","v":100},{"$f":"IF($A5=\"-\",\"\",Numericable!Q7)","v":12},{"$f":"IF($A5=\"-\",\"\",Numericable!R7)","v":"HD/HDD"},{"$f":"IF($A5=\"-\",\"\",Numericable!S7)","v":"X"},{"$f":"IF($A5=\"-\",\"\",Numericable!T7)","v":"50M/2.5M"},{"$f":"IF($A5=\"-\",\"\",Numericable!U7)","v":"100G"},{"$f":"IF($A5=\"-\",\"\",Numericable!V7)","v":"-"},{"$f":"IF($A5=\"-\",\"\",Numericable!W7)","v":"-"},{"$f":"IF($A5=\"-\",\"\",Numericable!X7)","v":"-"}]
[{"$f":"Numericable!L8","v":"Triple Play Extra"},{"$f":"IF($A6=\"-\",\"\",Numericable!M8)","v":"X"},{"$f":"IF($A6=\"-\",\"\",Numericable!N8)","v":25},{"$f":"IF($A6=\"-\",\"\",Numericable!O8)","v":"X"},{"$f":"IF($A6=\"-\",\"\",Numericable!P8)","v":130},{"$f":"IF($A6=\"-\",\"\",Numericable!Q8)","v":17},{"$f":"IF($A6=\"-\",\"\",Numericable!R8)","v":"Box 160 + HD"},{"$f":"IF($A6=\"-\",\"\",Numericable!S8)","v":"X"},{"$f":"IF($A6=\"-\",\"\",Numericable!T8)","v":"100M/5M"},{"$f":"IF($A6=\"-\",\"\",Numericable!U8)","v":"Illimité"},{"$f":"IF($A6=\"-\",\"\",Numericable!V8)","v":"X"},{"$f":"IF($A6=\"-\",\"\",Numericable!W8)","v":"Extra + Voisins"},{"$f":"IF($A6=\"-\",\"\",Numericable!X8)","v":"-"}]
[{"$f":"Numericable!L9","v":"Triple Play Max"},{"$f":"IF($A7=\"-\",\"\",Numericable!M9)","v":"X"},{"$f":"IF($A7=\"-\",\"\",Numericable!N9)","v":25},{"$f":"IF($A7=\"-\",\"\",Numericable!O9)","v":"X"},{"$f":"IF($A7=\"-\",\"\",Numericable!P9)","v":130},{"$f":"IF($A7=\"-\",\"\",Numericable!Q9)","v":17},{"$f":"IF($A7=\"-\",\"\",Numericable!R9)","v":"Box 320 + HD"},{"$f":"IF($A7=\"-\",\"\",Numericable!S9)","v":"X"},{"$f":"IF($A7=\"-\",\"\",Numericable!T9)","v":"200M/8M"},{"$f":"IF($A7=\"-\",\"\",Numericable!U9)","v":"Illimité"},{"$f":"IF($A7=\"-\",\"\",Numericable!V9)","v":"X"},{"$f":"IF($A7=\"-\",\"\",Numericable!W9)","v":"Extra + Monde"},{"$f":"IF($A7=\"-\",\"\",Numericable!X9)","v":"Mini Premium"}]
[{"$f":"Numericable!L10","v":"-"},{"$f":"IF($A8=\"-\",\"\",Numericable!M10)","v":""},{"$f":"IF($A8=\"-\",\"\",Numericable!N10)","v":""},{"$f":"IF($A8=\"-\",\"\",Numericable!O10)","v":""},{"$f":"IF($A8=\"-\",\"\",Numericable!P10)","v":""},{"$f":"IF($A8=\"-\",\"\",Numericable!Q10)","v":""},{"$f":"IF($A8=\"-\",\"\",Numericable!R10)","v":""},{"$f":"IF($A8=\"-\",\"\",Numericable!S10)","v":""},{"$f":"IF($A8=\"-\",\"\",Numericable!T10)","v":""},{"$f":"IF($A8=\"-\",\"\",Numericable!U10)","v":""},{"$f":"IF($A8=\"-\",\"\",Numericable!V10)","v":""},{"$f":"IF($A8=\"-\",\"\",Numericable!W10)","v":""},{"$f":"IF($A8=\"-\",\"\",Numericable!X10)","v":""}]
[{"$f":"Numericable!L11","v":"-"},{"$f":"IF($A9=\"-\",\"\",Numericable!M11)","v":""},{"$f":"IF($A9=\"-\",\"\",Numericable!N11)","v":""},{"$f":"IF($A9=\"-\",\"\",Numericable!O11)","v":""},{"$f":"IF($A9=\"-\",\"\",Numericable!P11)","v":""},{"$f":"IF($A9=\"-\",\"\",Numericable!Q11)","v":""},{"$f":"IF($A9=\"-\",\"\",Numericable!R11)","v":""},{"$f":"IF($A9=\"-\",\"\",Numericable!S11)","v":""},{"$f":"IF($A9=\"-\",\"\",Numericable!T11)","v":""},{"$f":"IF($A9=\"-\",\"\",Numericable!U11)","v":""},{"$f":"IF($A9=\"-\",\"\",Numericable!V11)","v":""},{"$f":"IF($A9=\"-\",\"\",Numericable!W11)","v":""},{"$f":"IF($A9=\"-\",\"\",Numericable!X11)","v":""}]
[{"$f":"Numericable!L12","v":"-"},{"$f":"IF($A10=\"-\",\"\",Numericable!M12)","v":""},{"$f":"IF($A10=\"-\",\"\",Numericable!N12)","v":""},{"$f":"IF($A10=\"-\",\"\",Numericable!O12)","v":""},{"$f":"IF($A10=\"-\",\"\",Numericable!P12)","v":""},{"$f":"IF($A10=\"-\",\"\",Numericable!Q12)","v":""},{"$f":"IF($A10=\"-\",\"\",Numericable!R12)","v":""},{"$f":"IF($A10=\"-\",\"\",Numericable!S12)","v":""},{"$f":"IF($A10=\"-\",\"\",Numericable!T12)","v":""},{"$f":"IF($A10=\"-\",\"\",Numericable!U12)","v":""},{"$f":"IF($A10=\"-\",\"\",Numericable!V12)","v":""},{"$f":"IF($A10=\"-\",\"\",Numericable!W12)","v":""},{"$f":"IF($A10=\"-\",\"\",Numericable!X12)","v":""}]
[{"$f":"Numericable!L13","v":"-"},{"$f":"IF($A11=\"-\",\"\",Numericable!M13)","v":""},{"$f":"IF($A11=\"-\",\"\",Numericable!N13)","v":""},{"$f":"IF($A11=\"-\",\"\",Numericable!O13)","v":""},{"$f":"IF($A11=\"-\",\"\",Numericable!P13)","v":""},{"$f":"IF($A11=\"-\",\"\",Numericable!Q13)","v":""},{"$f":"IF($A11=\"-\",\"\",Numericable!R13)","v":""},{"$f":"IF($A11=\"-\",\"\",Numericable!S13)","v":""},{"$f":"IF($A11=\"-\",\"\",Numericable!T13)","v":""},{"$f":"IF($A11=\"-\",\"\",Numericable!U13)","v":""},{"$f":"IF($A11=\"-\",\"\",Numericable!V13)","v":""},{"$f":"IF($A11=\"-\",\"\",Numericable!W13)","v":""},{"$f":"IF($A11=\"-\",\"\",Numericable!X13)","v":""}]
[{"$f":"Numericable!L14","v":"-"},{"$f":"IF($A12=\"-\",\"\",Numericable!M14)","v":""},{"$f":"IF($A12=\"-\",\"\",Numericable!N14)","v":""},{"$f":"IF($A12=\"-\",\"\",Numericable!O14)","v":""},{"$f":"IF($A12=\"-\",\"\",Numericable!P14)","v":""},{"$f":"IF($A12=\"-\",\"\",Numericable!Q14)","v":""},{"$f":"IF($A12=\"-\",\"\",Numericable!R14)","v":""},{"$f":"IF($A12=\"-\",\"\",Numericable!S14)","v":""},{"$f":"IF($A12=\"-\",\"\",Numericable!T14)","v":""},{"$f":"IF($A12=\"-\",\"\",Numericable!U14)","v":""},{"$f":"IF($A12=\"-\",\"\",Numericable!V14)","v":""},{"$f":"IF($A12=\"-\",\"\",Numericable!W14)","v":""},{"$f":"IF($A12=\"-\",\"\",Numericable!X14)","v":""}]
[{"$f":"Numericable!L15","v":"-"},{"$f":"IF($A13=\"-\",\"\",Numericable!M15)","v":""},{"$f":"IF($A13=\"-\",\"\",Numericable!N15)","v":""},{"$f":"IF($A13=\"-\",\"\",Numericable!O15)","v":""},{"$f":"IF($A13=\"-\",\"\",Numericable!P15)","v":""},{"$f":"IF($A13=\"-\",\"\",Numericable!Q15)","v":""},{"$f":"IF($A13=\"-\",\"\",Numericable!R15)","v":""},{"$f":"IF($A13=\"-\",\"\",Numericable!S15)","v":""},{"$f":"IF($A13=\"-\",\"\",Numericable!T15)","v":""},{"$f":"IF($A13=\"-\",\"\",Numericable!U15)","v":""},{"$f":"IF($A13=\"-\",\"\",Numericable!V15)","v":""},{"$f":"IF($A13=\"-\",\"\",Numericable!W15)","v":""},{"$f":"IF($A13=\"-\",\"\",Numericable!X15)","v":""}]
[{"$f":"Numericable!L16","v":"-"},{"$f":"IF($A14=\"-\",\"\",Numericable!M16)","v":""},{"$f":"IF($A14=\"-\",\"\",Numericable!N16)","v":""},{"$f":"IF($A14=\"-\",\"\",Numericable!O16)","v":""},{"$f":"IF($A14=\"-\",\"\",Numericable!P16)","v":""},{"$f":"IF($A14=\"-\",\"\",Numericable!Q16)","v":""},{"$f":"IF($A14=\"-\",\"\",Numericable!R16)","v":""},{"$f":"IF($A14=\"-\",\"\",Numericable!S16)","v":""},{"$f":"IF($A14=\"-\",\"\",Numericable!T16)","v":""},{"$f":"IF($A14=\"-\",\"\",Numericable!U16)","v":""},{"$f":"IF($A14=\"-\",\"\",Numericable!V16)","v":""},{"$f":"IF($A14=\"-\",\"\",Numericable!W16)","v":""},{"$f":"IF($A14=\"-\",\"\",Numericable!X16)","v":""}]
[]
["Telenet","Analog TV",null,"Digital TV",null,null,null,"Broadband",null,null,"Telephony",null,"Extras"]
["Name","Analog TV","#Channels","Digital TV","#Channels","#HD Channels","Decoder","Broadband","Bitrate Dn[/Up]","Quota","Telephony","Options","-"]
[{"$f":"Telenet!L5","v":"TV Analogique"},{"$f":"IF($A18=\"-\",\"\",Telenet!M5)","v":"X"},{"$f":"IF($A18=\"-\",\"\",Telenet!N5)","v":"?"},{"$f":"IF($A18=\"-\",\"\",Telenet!O5)","v":"-"},{"$f":"IF($A18=\"-\",\"\",Telenet!P5)","v":"-"},{"$f":"IF($A18=\"-\",\"\",Telenet!Q5)","v":"-"},{"$f":"IF($A18=\"-\",\"\",Telenet!R5)","v":"-"},{"$f":"IF($A18=\"-\",\"\",Telenet!S5)","v":"-"},{"$f":"IF($A18=\"-\",\"\",Telenet!T5)","v":"-"},{"$f":"IF($A18=\"-\",\"\",Telenet!U5)","v":"-"},{"$f":"IF($A18=\"-\",\"\",Telenet!V5)","v":"-"},{"$f":"IF($A18=\"-\",\"\",Telenet!W5)","v":"-"},{"$f":"IF($A18=\"-\",\"\",Telenet!X5)","v":"-"}]
[{"$f":"Telenet!L6","v":"TV Digitale"},{"$f":"IF($A19=\"-\",\"\",Telenet!M6)","v":"X"},{"$f":"IF($A19=\"-\",\"\",Telenet!N6)","v":"?"},{"$f":"IF($A19=\"-\",\"\",Telenet!O6)","v":"X"},{"$f":"IF($A19=\"-\",\"\",Telenet!P6)","v":75},{"$f":"IF($A19=\"-\",\"\",Telenet!Q6)","v":"?"},{"$f":"IF($A19=\"-\",\"\",Telenet!R6)","v":"HD Digicorder"},{"$f":"IF($A19=\"-\",\"\",Telenet!S6)","v":"-"},{"$f":"IF($A19=\"-\",\"\",Telenet!T6)","v":"-"},{"$f":"IF($A19=\"-\",\"\",Telenet!U6)","v":"-"},{"$f":"IF($A19=\"-\",\"\",Telenet!V6)","v":"-"},{"$f":"IF($A19=\"-\",\"\",Telenet!W6)","v":"-"},{"$f":"IF($A19=\"-\",\"\",Telenet!X6)","v":"-"}]
[{"$f":"Telenet!L7","v":"Whop"},{"$f":"IF($A20=\"-\",\"\",Telenet!M7)","v":"X"},{"$f":"IF($A20=\"-\",\"\",Telenet!N7)","v":"?"},{"$f":"IF($A20=\"-\",\"\",Telenet!O7)","v":"X"},{"$f":"IF($A20=\"-\",\"\",Telenet!P7)","v":75},{"$f":"IF($A20=\"-\",\"\",Telenet!Q7)","v":"?"},{"$f":"IF($A20=\"-\",\"\",Telenet!R7)","v":"HD Digicorder"},{"$f":"IF($A20=\"-\",\"\",Telenet!S7)","v":"X"},{"$f":"IF($A20=\"-\",\"\",Telenet!T7)","v":"60M/4M"},{"$f":"IF($A20=\"-\",\"\",Telenet!U7)","v":"100G"},{"$f":"IF($A20=\"-\",\"\",Telenet!V7)","v":"X"},{"$f":"IF($A20=\"-\",\"\",Telenet!W7)","v":"FreePhone EU"},{"$f":"IF($A20=\"-\",\"\",Telenet!X7)","v":"-"}]
{"$rows_left_out":25}
{"sheet":"Overview","index":5,"n_rows":32,"n_cols":13,"rows_kept":32,"cut":false,"hidden":false,"merged":[]}
["Numericable",{"$f":"TRANSPOSE(Numericable!C5:C16)","v":"Télédistribution"},"TV Plus (digital)","Duo TV+Web","Triple Play Extra","Triple Play Max","-","-","-","-","-","-","-"]
["Pack Retail price (VAT incl.)",17.809999999999999,27.9,39.9,55.9,69.900000000000006]
["Minus VAT (21%)",-3.0909917355371892,-4.8421487603305771,-6.9247933884297481,-9.7016528925619809,-12.131404958677685]
["Pack Retail price (VAT excl.)",14.71900826446281,23.057851239669422,32.97520661157025,46.198347107438018,57.768595041322321]
["Share of (TV+BB+Rights)",1,0.99999999999999989,1,0.79030184383409485,0.71191066839275785]
["2P equiv. Pack Retail price (VAT excl.)",14.71900826446281,23.057851239669418,32.97520661157025,36.510638901095788,41.126079107978327]
["Minus TV Rights (TVA excl.)",-3.3057851239669422,-4.0495867768595044,-4.0495867768595044,-4.0495867768595044,-4.0495867768595044]
["Minus application base (VAT excl.)",11.413223140495868,19.008264462809912,28.925619834710744,32.461052124236282,37.076492331118821]
["Minus \"Minus\"",-0.2,-0.2,-0.2,-0.2,-0.2]
["Wholesale tariff (VAT excl.)",9.1305785123966938,15.206611570247929,23.140495867768596,25.968841699389028,29.661193864895058]
[]
["Telenet",{"$f":"TRANSPOSE(Telenet!C5:C16)","v":"TV Analogique"},"TV Digitale","Whop","Whoppa","-","-","-","-","-","-","-","-"]
["Pack Retail price (VAT incl.)",15.2,23.4,61.45,71.7]
["Minus VAT (21%)",-2.6380165289256201,-4.0611570247933884,-10.664876033057851,-12.44380165289256]
["Pack Retail price (VAT excl.)",12.561983471074379,19.33884297520661,50.785123966942152,59.256198347107443]
["Share of (TV+BB+Rights)",1,1,0.7771252291885935,0.81728413561761348]
["2P equiv. Pack Retail price (VAT excl.)",12.561983471074379,19.33884297520661,39.466401102181052,48.429150846101564]
["Minus TV Rights (TVA excl.)",-2.6280991735537191,-2.6280991735537191,-2.6280991735537191,-2.6280991735537191]
["Minus application base (VAT excl.)",9.9338842975206596,16.710743801652892,36.838301928627331,45.801051672547842]
["Minus \"Minus\"",-0.3,-0.3,-0.23,-0.23]
{"$rows_left_out":13}
{"sheet":"Lists","index":6,"n_rows":26,"n_cols":5,"rows_kept":26,"cut":false,"hidden":false,"merged":[]}
[]
["Operators","Numericable"]
[null,"Voo - Brutele"]
[null,"Voo - Tecteo"]
[null,"Telenet","operators"]
[]
[]
["Offer types","Analog TV","Analog TV"]
[null,"Digital TV","Digital TV"]
[null,"Dual play","Pack"]
[null,"Triple play","Pack"]
[null,"offer.types","offer.types.minus"]
[]
["Service components","Analog TV"]
[null,"Digital TV"]
[null,"Decoder"]
[null,"TV Rights"]
[null,"Broadband"]
[null,"Telephony"]
[null,"Extra","service.components"]
{"$rows_left_out":6}